huID,profile URL,Additional phenotypic data,Genotypic array data,Age,Sex/Gender,Race/Ethnicity,Stomach cancer,Colon cancer,Rectal cancer,Colon polyps,Pancreatic cancer,Lung cancer,Melanoma,Non-melanoma skin cancer,Lipoma,Breast cancer,Breast fibroadenoma,Cervical cancer,Endometrial cancer,Uterine fibroids,Ovarian cancer,Prostate cancer,Bladder cancer,Kidney cancer,Thyroid cancer,Non-Hodgkin lymphoma,Leukemia,Polycythemia vera,Essential thrombocythemia,Neurofibromatosis,Brain cancer,Thyroid nodule(s),Graves' disease,Hypothyroidism,Hashimoto's thyroiditis,Diabetes mellitus; type 1,Diabetes mellitus; type 2,Primary hyperparathyroidism,Growth hormone deficiency,Polycystic ovary syndrome (PCOS),Lactose intolerance,High cholesterol (hypercholesterolemia),High triglycerides (hypertriglyceridemia),Alpha 1-antitrypsin deficiency,Gout,Hemochromatosis,Cystic fibrosis,Porphyria,Gilbert syndrome,Iron deficiency anemia,Pernicious anemia (a.k.a. Addison-Biermer anemia),Folate deficiency anemia,Hereditary spherocytosis,G6PD deficiency,Sickle cell trait (carrier),Sickle cell anemia,Autoimmune hemolytic anemia,Hemophilia,Von Willebrand disease,Idiopathic thrombocytopenic purpura (ITP),Hereditary thrombophilia (includes Factor V Leiden and Prothrombin G20210A),Other thrombophilia (includes antiphospholipid syndrome),Recurrent Sleep Paralysis,Parkinson's Disease,Essential tremor,Huntington's Disease,Restless Legs Syndrome,Spinal muscular atrophy,Amyotrophic lateral sclerosis (ALS),Cluster headaches,Chronic tension headaches (15+ days per month; at least 6 months),Multiple sclerosis (MS),Cerebral palsy,Epilepsy,Migraine with aura,Migraine without aura,Narcolepsy,Arnold-Chiari malformation,Trigeminal neuralgia,Bell's palsy,Carpal tunnel syndrome,Hereditary motor and sensory neuropathy (includes Charcot-Marie-Tooth disease and HNPP),Other peripheral neuropathy,Muscular dystrophy,Retinal detachment,Diabetic retinopathy,Hypertensive retinopathy,Central serous retinopathy,Age-related macular degeneration,Retinitis pigmentosa,Glaucoma,Infantile; juvenile; and presenile cataract,Age-related cataract,Traumatic cataract,Hyperopia (Farsightedness),Myopia (Nearsightedness),Astigmatism,Presbyopia,Color blindness,Keratoconus,Dry eye syndrome,Strabismus,Floaters,Congenital nystagmus,Meniere's disease,Otosclerosis,Age-related hearing loss,Tinnitus,Sensorineural hearing loss or congenital deafness,Hypertension,Myocardial infarction (heart attack),Angina,Pulmonary embolism,Mitral valve prolapse,Hypertrophic cardiomyopathy,Dilated cardiomyopathy,Restrictive cardiomyopathy,Other cardiomyopathy (includes ARVD),Bundle branch block,Wolff-Parkinson-White (WPW) Syndrome,Long QT Syndrome,Heart block,Atrial fibrillation,Premature ventricular contractions,Sick sinus syndrome (includes tachy-brady syndrome),Cardiac arrhythmia,Congestive heart failure,Stroke,Aortic aneurysm,Other aneurysm,Raynaud's phenomenon,Kawasaki disease,Hereditary hemorrhagic telangiectasia (also known as Osler-Weber-Rendu syndrome),Deep vein thrombosis (DVT),Varicose veins,Hemorrhoids,Varicocele,Deviated septum,Nasal polyps,Chronic sinusitis,Chronic/recurrent tonsillitis,Allergic rhinitis (includes hay fever),Chronic bronchitis,Emphysema,Asthma,Chronic Obstructive Pulmonary Disease (COPD),Impacted tooth,Dental cavities,Gingivitis,Temporomandibular joint (TMJ) disorder,Canker sores (oral ulcers),Geographic tongue,Fissured tongue,Gastroesophageal Reflux Disease (GERD),Barrett's esophagus,Peptic ulcer (stomach or duodenum),Appendicitis,Inguinal hernia,Hiatal hernia,Crohn's disease,Ulcerative colitis,Diverticulosis,Irritable bowel syndrome (IBS),Rectal prolapse,Acute liver failure,Chronic liver disease and cirrhosis,Nonalcoholic fatty liver disease (NAFLD),Gallstones,Celiac disease,Kidney stone(s),Acute kidney failure,Chronic kidney failure,Urinary tract infection (UTI),Urethral diverticulum,Benign prostatic hypertrophy (BPH),Male infertility,Peyronie's disease,Spermatocele,Fibrocystic breast disease,Bartholin's cyst,Endometriosis,Uterine prolapse,Ovarian cysts,Female infertility,Pilonidal cyst,Dandruff,Eczema,Allergic contact dermatitis,Rosacea,Psoriasis,Lichen planus,Keloids,Skin tags,Hair loss (includes female and male pattern baldness),Alopecia areata,Hyperhidrosis (excessive sweating),Hidradenitis suppurativa,Acne,Dermatographia,Cafe au lait spots,Systemic lupus erythematosus,Sjogren's syndrome (Sicca syndrome),Rheumatoid arthritis,Osteoarthritis,Chondromalacia patella (CMP),Spinal stenosis,Sciatica,Frozen shoulder,Rotator cuff tear,Tennis elbow,Achilles tendinitis,Bone spurs,Trigger finger,Bunions,Dupuytren's contracture,Plantar fasciitis,Fibromyalgia,Scheuermann's kyphosis,Osgood-Schlatter disease,Osteoporosis,Flatfeet (fallen arches),Postural kyphosis,Scoliosis,Spina bifida,Congenital ocular coloboma,Congenital heart defect,Cleft palate,Cleft uvula,Cleft lip,Tongue tie (ankyloglossia),Bifid tongue (cleft tongue),Infantile pyloric stenosis,Hirschsprung's disease,Hypospadias,Renal agenesis (missing kidney),Polycystic kidney disease,Congenital hydronephrosis,Developmental dysplasia of the hip,Congenital clubfoot (equinovarus),Polydactyly,Syndactyly (webbing of digits),Ehlers-Danlos syndrome,Ichthyosis vulgaris,Single transverse palmar crease (simian crease),Marfan syndrome
hu005EB9,https://my.personalgenomes.org/profile/hu005EB9,Y,Family Tree DNA,50-59 years,Female,White,,,,Y,,,,,,,,,,,,,,,,,,,,,,Y,,,Y,,,,,,,,,,,,,,,,,,,,,,,,,,,,,,,,,,,,,,,,Y,,,,,,,,,,,,,,,,,,,,,Y,,,,,,,Y,,,,,,,,,,,,,,,,,,,,,,,,,,,,,,,,,,,,,,,,,,Y,,,Y,,,,,,,,,,,,,,,,,,,,,,,,,,,,,,,,,,,,,,,,Y,,,Y,,,,,,,,,Y,,,,,,,,,,,,,,,,,,,,,,,Y,,,,,,,,,,,,,,,,,,,,,,
hu00D419,https://my.personalgenomes.org/profile/hu00D419,N,N,50-59 years,Female,White,,,,Y,,,,,,,,,,Y,,,,,,,,,,,,Y,,,,,,,,,,,,,,,,,,,,,,,,,,,,,,,,,,,,,,Y,,,,,Y,,,,,,Y,,Y,,,,,,,,,,,,,,,Y,,,,,,,,,,Y,,,,,,,,,,,,,,,,Y,,Y,,,,,,,,,,,,,,,,,,,,,,Y,,Y,Y,,,,,,,,,,,,,,,,,,,,,,Y,,,,,,Y,,,,Y,,,Y,Y,Y,,,,,,,,,,,,,,,,Y,,,Y,,,,,,Y,,Y,Y,Y,,,,,,Y,,,,,,,,,,,,,,,,,,,,,,
hu01024B,https://my.personalgenomes.org/profile/hu01024B,Y,N,60-69 years,,,,,,Y,,,,Y,,,,,,,,,,,,,,,,,,,,,,,,,,,,,,,,,,,,,,,,,,,,,,,,,,,,,,,,,,,,,,,,,,,,,,,,,,,,,,,,,,,,,,,,,,,,,Y,Y,,,,,,,,,,,,,,,,,,,,,,,,,,,,,,,,,,,,,,,,Y,,,,,,,,,,Y,,,,,,,,,,,,,,,,,,,,,,,,,,,,,,,,,,,,,,,,,,,,,,,,,,,,,,,,,,,,,,,,,,,,,,,,,,,,,,,,,,,,,,,
hu016B28,https://my.personalgenomes.org/profile/hu016B28,Y,23andMe,40-49 years,Male,White,,,,Y,,,,,,,,,,,,,,,,,,,,,,,,,,,Y,,,,,Y,Y,,,,,,,,,,,,,,,,,,,,,,,,,,,,,,,,,,,,,,,,,,,,,,,,,,,,,Y,,Y,,,,,,,,,,,,,,,,,,,,,,,,,,,,,,,,,,,,,,Y,,Y,,,,,,,,,Y,Y,Y,,,,,,,,,,,,,Y,,,,,,Y,,,,,Y,,,Y,,,,,,,,,,Y,,,,,,,,,,,,Y,,,,,,,,Y,,,,,,,Y,,,,,,,,,,,,,,,,,,,,,,,,,,,,,,,,
hu0211D6,https://my.personalgenomes.org/profile/hu0211D6,N,N,30-39 years,Female,White,,,,,,,,,,,,,,,,,,,,,,,,,,,,,,,,,,,,,,,,,,,,,,,,,,,,,,,,,,,,,,,,,,,,,,,,,,,,,,,,,,,,,,,Y,,,Y,Y,,,,,,Y,,,,,,,,,,,,,,,,,,,,,Y,,,,,,,,,,,,Y,,Y,,,,,,,,,,Y,,,Y,,,,,,Y,,,,,,,,,,,,,,,,,,,,,,,,,,,,,,,Y,Y,,,,Y,,,,,Y,,,,,,,,,,,,,,,,,,Y,,,,,,,,,,,,,,,,,,,,,,,,,,,,,
hu032C04,https://my.personalgenomes.org/profile/hu032C04,N,23andMe; Illumina Genome,50-59 years,Male,White,,,,,,,,,,,,,,,,,,,,,,,,,,,,,,,,,,,,Y,,,,,,,,,,,,,,,,,,,,,,,,,,,,,,,,,,,,,,,,,,,,,,,,,,,,,,Y,,,,,,,,,,,,,,,,,,,,,,,,,,,,,,,,,,,,,,,,,,,Y,Y,,,,,,,Y,Y,Y,,,Y,Y,,,,,,,,,,,,,,,,,,,,,,,,,,,,,,,,,Y,,,,,,,,Y,,Y,,,,,,,,,,,,,,,,,,,,,,,,,,,,,,,,,,,,,,,,,,,,,,,,,
hu03AF0E,https://my.personalgenomes.org/profile/hu03AF0E,Y,N,50-59 years,Female,White,,,,,,,,,,,,,,,,,,,,,,,,,,,,Y,,,,,,,,Y,,,,,,,,Y,,,,,,,,,,,,,,,,,,,,,,,,,Y,,,,,,,,,,,,,,,,,,,,,Y,Y,,,,,,,,,,,,,,,,,,,,,,,,,,,,,,,,,,,,,,,,,,,,,,,,,,,Y,,Y,,,,,,,,,,,,,Y,,,,,Y,,,,,Y,,,,,,Y,,,,Y,,,Y,,,Y,,,,,,,,,Y,,,,,,,,,,Y,,,,,,,,Y,Y,,,,,,,,,,,,,,,,,,,,,,,,,,,,
hu04693B,https://my.personalgenomes.org/profile/hu04693B,Y,N,21-29 years,Female,White,,,,,,,,,,,,,,,,,,,,,,,,,,,,,,,,,,Y,,,,,,,,,,,,,,,,,,,,,,,,,,,,,,,,,,,,,,,,,,Y,,,,,,,,,,,,,,Y,Y,,,,,,,,,,,,,,,,,,,,,,,,,,,,,,,,,,,,,,,,,,,,,,,,,,Y,,,,Y,,,,,,,,,,,,,,,,,,,,,,,,,,,,,,,,,,,,,,,,,,,,,,,Y,,,,,,,,,,,,,,,,,,,,,,,,,,,,,,,,,,,,,,,,,,,,,,,
hu04DF3C,https://my.personalgenomes.org/profile/hu04DF3C,Y,N,50-59 years,Female,White,,,,,,,,,,,,,,,,,,,,,,,,,,,,,,,,,,,,,,,,,,,,,,,,,,,,,,,,,,,,,,,,,,,,,,,,,,,,,,,,,,,,,,,,,,,,,,,,,,,,,Y,,,,,,,,,,,,,,,,,,,,,,,,,,,,Y,,,,,,,,,,,,Y,Y,,,,,,,,,,,,,,,,,,,,,,,,,Y,,,,,,,,,,,,,Y,,,,,,,,,,,,Y,,,,,,,,,,Y,,,,Y,,Y,,Y,,,,,,,,,,,,,,,,,,,,,,,,,,,,,
hu050E9C,https://my.personalgenomes.org/profile/hu050E9C,Y,N,70-79 years,Male,,,,,,,,,,,,,,,,,Y,,,,,,,,,,,,Y,,,,,,,,,,,,,,,,,,,,,,,,,,,,,,,,,,,,,,,,,,,,,,,,,,,,,,,,,,,,,,Y,Y,,,,,,,,,,Y,,,,,,,,,,,,,,,,,,,,,,,,,,,,,,,,,,,,,,,,Y,Y,Y,,,,,,,,,,,,,,,,,,,,,,,,,,,,,,,,,,,,,,,,,,,,,,,,,,,,,,,,,,,,,,,,,,,Y,,,,,,,,,,,,,,,,,,,,,,,,,,,,,
hu05FD49,https://my.personalgenomes.org/profile/hu05FD49,Y,23andMe,50-59 years,Male,White,,,,,,,,,Y,,,,,,,,,,,,,,,,,,,,,,,,,,,Y,Y,,,,,,,,,,,,,,,,,,,,,,,,,,,,,,,,,,,,,,,,,,,,,,,,,,,,Y,,Y,Y,,,,,,,,,,Y,,Y,,,,,,,,,,,,,,,,,,,,,,,,,Y,,Y,,,,,,,,,,Y,Y,Y,,Y,,,,,,,,,,,,,,,,,,,,,,,,,,,Y,,,,,,,,Y,,,,,,,,,,,,Y,,,,,,,,,,,,,,,,,,,,,,,,,,,,,,,,,,,,,,,,,,,,,,,
hu083037,https://my.personalgenomes.org/profile/hu083037,N,N,21-29 years,Male,Hispanic or Latino; White,,,,,,,,,,,,,,,,,,,,,,,,,,,,,,,,,,,,,,,,,,,,,,,,,,,,,,,,,,,,,,,,,,,,,,,,,,,,,,,,,,,,,,,,,,,,,,,,,,,,,,,,,,,,,,,,,,,,,,,,,,,,,,,,,,,,,,,,,,,,,,Y,Y,,Y,,,,,,,,,,,,,,,,,,,,,,,,,,,,,,,,,,,Y,Y,,,,,,,,,,,,,,,,,,,,,,,,,,,,,,,,,,,,,,,,,,,,,,,,,,,,,,,,,,
hu089792,https://my.personalgenomes.org/profile/hu089792,Y,N,60-69 years,Female,White,,,,,,,,,,,,,,,,,,,,,,,,,,,,,,,,,,,,,,,,,,,,,,,,,,,,,,,,,,,,,,,,,,Y,,,,,,,,,,,,,,,,,,,,,Y,,,Y,Y,Y,,,,,Y,,,,,,,,,,,,,,,,,,,,,,,,,,,,,,,,,Y,,,,,,,,,,,,Y,,,Y,,,,,,,,,,,,,,,,,,Y,,,,Y,,,,,,Y,,,,,,,,,,,,,,Y,,,,,,,,,,,,,,,,,,,Y,,,,Y,,,,,,,,,,,,,,,,,,,,,,,,,,,,,
hu0A6570,https://my.personalgenomes.org/profile/hu0A6570,N,N,21-29 years,Male,White,,,,,,,,,,,,,,,,,,,,,,,,,,,,,,,,,,,,,,,,,,,,,,,,,,,,,,,,,,,,,,,,,,,,,,,,,,,,,,,,,,,,,,,,,,,,,,,,,,,,,,,,,,,,,,,,,,,,,,,,,,,,,,,,,,,,,,,,,,,,,,,Y,,,,,,,,,,,,,,,,,,,,,,,,,,,,,,,,,,,,,,,,,,,,,,,,,Y,,,,,,,,,,,,,,,,,,Y,,,,,,,,,,,,,,,,,,,,,,,,,,,,,
hu0B100A,https://my.personalgenomes.org/profile/hu0B100A,N,N,21-29 years,Male,White,,,,,,,,,,,,,,,,,,,,,,,,,,,,,,,,,,,,,,,,,,,,,,,,,,,,,,,,,,,,,,,,,,,,,,Y,,,,,,,,,,,,,,,,,,,,,,,,,,,Y,,,,,,,,,,,,,,,,,,,,,,,,,,,,,,,,,,Y,,,,,,,,,,,Y,,,,,,,,,,,,,,,,,,,,,,,,,,,,,,,,,,,,,,,,,,,,,,,,,,Y,,,,,,,,,,,,,,,,,,,,,,,,,,,,,,,,,,,,,,,,,,,,,,,
hu0CE0FB,https://my.personalgenomes.org/profile/hu0CE0FB,Y,N,40-49 years,Female,White,,,,,,,,,,,,,,Y,,,,,,,,,,,,,,,,,,,,,,Y,,,,,,,,,,,,,,,,,,,,Y,,,,,,,,,,,,,,,,,,,,,,,,,,,,,,,,,,Y,Y,,,,Y,,Y,,,,,Y,,,,,,,,,,,,,,,,,,,,,,,Y,,,,Y,Y,,,,,,,Y,,Y,,Y,Y,Y,,,,,,,,,,,,,Y,Y,Y,,,,,,,,,Y,,,,,,,,Y,,Y,,,Y,,Y,,,,Y,,Y,,,,,,Y,,,,Y,Y,,,,,Y,,,,,,Y,,,,,,,Y,,,Y,,,,,,,,,,,,,,,,Y,,,
hu0D1FA1,https://my.personalgenomes.org/profile/hu0D1FA1,Y,N,30-39 years,Female,White,,,,,,,,,,,,,,,,,,,,,,,,,,,,,,,,,,,,,,,,,,,,,,,,,,,,,,,,,,,,,,,,,,,,,,,,,,,,,,,,,,,,,,,,,,Y,,,,,,,,,,,,,,Y,,,,,,,,,,,,,,,,,,,,,,,,,,,,Y,,,,,,,,,,Y,,Y,Y,,,,,,,,,,,,,,,,,,,,,,Y,,,,,,,,,,Y,,,,,,,,,,Y,,,,,,,,,,,,,,,,,Y,,,,,,,,,,,,,Y,,,,,,,,,,,,,,,,,,,,,,
hu0EC5C6,https://my.personalgenomes.org/profile/hu0EC5C6,N,N,21-29 years,Female,Black or African American,,,,,,,,,,,,,,,,,,,,,,,,,,,,,,,,,,,,,,,,,,,,,,,,,,,,,,,,,,,,,,,,,,,,,,,,,,,,,,,,,,,,,,,,,,Y,Y,,,,,,,,,,,,,,,,,,,,,,,,,,,,,,,,,,,,,,,,,,,,,,,,,,,,,,,,,,,,,,,,,,,,,,,,,,,,Y,,,,,,,,,,,,,,,,,,,,,,,,,,,,,,,,,,,,,,,,,,,,,,,,,,,,,,,,,Y,,,,,,,,,,,,,,,
hu0F0879,https://my.personalgenomes.org/profile/hu0F0879,N,N,50-59 years,Male,White,,,,,,,,,,,,,,,,,,,Y,Y,,,,,,Y,,,,,,,,,,,,,,,,,,,,,,,,,,,,,,,,,,,,,,,,,,,,,,,,,,,,,,,,,,,,,,,,Y,,,,,,,,,,,,,,,,,,,,,,,,,,,,,,,,,,,,,,,,,,,,,,,,,,,,,,,,,,,,,,,,Y,,,,,,,,,,,,,,,,,,,,,,,,,,,,,,,,,,Y,,,,Y,,,,,,,,,,,,,,,,,,,,,,,,,,,,,,,,,,,,,,,,,,,,,,,
hu0F33F3,https://my.personalgenomes.org/profile/hu0F33F3,Y,N,21-29 years,Female,White,,,,,,,,,,,,,,,,,,,,,,,,,,,,,,,,,,,,,,,,,,,,Y,,,,,,,,,,,,,,,,,,,,,,,,,,Y,,,,,,,,,,,,,,,,,,,,,Y,Y,,,,Y,,,,,,,,,,,,,,,,,,,,,,,,,,,,,,,,,,Y,,,,,,,,,,,,Y,,,Y,,,,,,,,,,,,,,,,,,,,,,Y,,,,,,,,,,Y,Y,,,Y,,,,,,,,,,,Y,,,,,,,,,,,,,,,,,,Y,,,,,,,,,,,,,,,,,,,,,,,,,,,,,
hu0FB755,https://my.personalgenomes.org/profile/hu0FB755,Y,N,50-59 years,Male,White,,,,,,,,,,,,,,,,,,,,,,,,,,,,,,,,,,,,Y,Y,,,,,,,,,,,,,,,,,,,,,,,,,,,,,,,,,,,,,,,,,,,,,,,,,,,,,Y,Y,,,,,,Y,,,,,,,Y,,,,,,,,,,,,,,,,,,,,,,,,,,,,,,,,,,,,,,Y,,,,,,,,,,,Y,,,,Y,,,,,,,,,,,,Y,,,,,,,,,,,,,,,,,,,,,,,,,,,,,,,,,,,,,,,,,,,,,,,,,,,,,,,,,,,,,,,,,,,,,,
hu1097B2,https://my.personalgenomes.org/profile/hu1097B2,Y,23andMe,40-49 years,Female,White,,,,,,,,,,,,,,,,,,,,,,,,,,,,,,,,,,,,,,,,,,,,,,,,,,,,,,,,,,,,,,,,,,,,,Y,,,,,,,,,,,,,,,,,,,,Y,Y,,,,,,,,,,,,,,,,,,,,,,,,,,,,,,,,,,,,,,,,,,,,,,,,,,,,Y,,,Y,,,,,,,,,,,,,,,,,,,,,,Y,,,,,,,,,,,,,Y,,,,,,,Y,,,,,,,Y,,,,,,,,,,,,,,,,,,,,,,,Y,,,,,,,,,,,,,,,,,,,,,,
hu114F80,https://my.personalgenomes.org/profile/hu114F80,Y,N,50-59 years,Male,White,,,,,,,,,,,,,,,,,,,,,,,,,,,,Y,,,,,,,,,,,,,,,,,,,,,,,,,,,,,,,,,,,,,,,,,,,,,,,,,,,,,,,,,,,,,,,Y,,,,,,,,,,,,,,,,,,,,,,,,,,,,,,,,,,,,,,,,,,,,,,,,,,,Y,,,Y,,,,,,Y,,,,,,,,,,,,,,,,,,,,,,,,,,,,,,,,,,,,,Y,,,,,,,,,,,,,,,,,,,,,,,,,,,,,,,,,,,,,,,,,,,,,,,,,,,
hu11603C,https://my.personalgenomes.org/profile/hu11603C,Y,23andMe,40-49 years,Female,White,,,,,,,,Y,Y,,,,,Y,,,,,,,,,,,,Y,,Y,Y,,Y,,,,,Y,Y,,,,,,,Y,Y,,,,,,,,,,,,,,,,,,,,,,,Y,Y,,Y,,,,Y,,Y,,,,,,,,,,,,,Y,Y,Y,,,Y,,Y,,,,,Y,,,,,,Y,,,,,,,,,,,,,,,,,,,,,Y,Y,,Y,,,,,,,Y,,Y,Y,,Y,Y,,Y,,,Y,,,,,,Y,,Y,,,,Y,,,,,Y,,,,,,Y,,,,Y,Y,,Y,Y,Y,Y,,,,Y,,,,,Y,,,,,,Y,Y,,,Y,,Y,,Y,Y,Y,Y,Y,Y,,Y,Y,,Y,Y,,,Y,,,,,,,,,,,,,,,,Y,,,
hu117D1E,https://my.personalgenomes.org/profile/hu117D1E,N,N,60-69 years,Female,White,,,,,,,,,,,,,,Y,,,,,,,,,,,,,,,,,,,,,,Y,,,,,,,,,,,,,,,,,,,,,,,,,,,,,,,,,,,,,Y,,Y,,,,,,,,,,,,,,Y,Y,,,,,,,,,,,,,,,,,,,,,,,,,,,,,,,,,,,,,,,,,,,,,,,,,,,,Y,,,Y,,,,,,,,Y,,,Y,,,,,,,,,,,Y,,,,,,,,Y,,Y,,,,,,,Y,,,,,,,,,,,,,Y,,,,Y,,Y,,,,,,,,,,,,,,,,,,,,,,,,,,,,,,,,,,,,
hu1187FF,https://my.personalgenomes.org/profile/hu1187FF,Y,23andMe,50-59 years,Female,White,,,,,,,,,,,,,,Y,,,,,,,,,,,,,,,,,,,,,,Y,Y,,,,,,,Y,,,,,,,,,,,,,,,,,,,,,,,,,,Y,,,,,,,,,,,,,,,,,Y,,,,,Y,,,,,,,,,Y,Y,Y,,,,,,,,,,,,,,,,,,,,,,,,,,,Y,,,,,,,,,,,,Y,Y,,Y,,,,,Y,,,,,,,,,,,,,,,,,,,,,,,,,,,,,,Y,,Y,,,,,Y,Y,,,,,,,,,,,Y,,,,,,,,,,,,,,,,,,,,,,,,,,,,,,,,,,,,,,,,
hu132B5C,https://my.personalgenomes.org/profile/hu132B5C,Y,N,30-39 years,Female,White,,,,,,,,,,,,,,,,,,,,,,,,,,,,,,,,,,,,,,,,,,,,,,,,,,,,,,,,,,,,,,,,,,,,,,,,,,,,,,,,,,,,,,,,,,,,,,,,,,,,,,,,,,,,,,,,,,,,,,,,,,,,,,,,,,,,,,,,,,,,,,,,,,,,,,,,,,,,,,,,,,,,,,,,,,,,,,,,,,,,,,,,,,,,,,,,Y,,,,,,,,,,,,,,,,,,,,,,,,,,,,,,,,,,,,,,,,,,,,,,,
hu1378E3,https://my.personalgenomes.org/profile/hu1378E3,N,N,,,,,,,,,,,,,,,,,,,,,,,,,,,,,,,,,,,,,,,,,,,,,,,,,,,,,,,,,,,,,,,,,,,,,,,,,,,,,,,,,,,,,,,,,,,,,Y,Y,,,,,,Y,,,,,,,,,,,,,,,,,,,,,,,,,,,,,,,,,,,,,,,,,,Y,,,,,,,,,,,,Y,,,,,,,,,,,,,,,,,,,,,,,,,,,,,Y,,,Y,,,,,,,,,Y,,,,,,,,,,,,,,,,,,,,,Y,,,,,,,,,,,,,,,,,,,,,,,,,,
hu15402B,https://my.personalgenomes.org/profile/hu15402B,Y,N,60-69 years,Male,White,,,,,,,,Y,,,,,,,,,,,,,,,,,,,,,,,,,,,,,,,,,,,,,,,,,,,,,,,,,,,,,,,,,,,,,,,,,,,,,,,,,,,,,,,,,,Y,Y,,,,,,,,,,,Y,,,,,,,,,,,,,,,,,,,,,,,,,,,,,,,,,,,,,,,,Y,Y,,,,,,,,,,,,,,,,,,,,,,,,,,,,,,,,,,,,,,,,,,,,,,,,,Y,,,,,,,,,,,,,,,,,,Y,,,,,,,,,,,,,,,,,,,,,,,,,,,,,
hu15FECA,https://my.personalgenomes.org/profile/hu15FECA,N,N,30-39 years,Male,White,,,,,,,,,,,,,,,,,,,,,,,,,,,,,,,,,,,,,,,,,,,,,,,,,,,,,,,,,,,,,,,,,,,,,,,,,,,,,,,,,,,,,,,,,,,,,,,,,,,,,,,,,,,,,,,,,,,,,,,,,,,,,,,,,,,,,,,,,,,,,Y,,,,Y,,,,,,,,,,,,,,,,,,,,,,,,,,,,,,,,,,,Y,,,,,,,,,,,,,,,,,,,,,Y,,,,,,,,,,,,,,,,,,,,,,,,,,,,,,,,,,,,,,
hu165E62,https://my.personalgenomes.org/profile/hu165E62,Y,N,40-49 years,Male,Hispanic or Latino,,,,,,,,,,,,,,,,,,,,,,,,,,,,,,,,,,,,Y,,,,,,,,,,,,,,,,,,,,,,,,,,,,,,,,,,,,,,,,,,,,,,,,,,,,,,Y,,,,,,,,,,,,,,Y,,,,,,,,,,,,,,,,,,,,,,,,,,,,,,,,,,,,,,Y,,,,,,,,,,,,,,,,,,,,,,,,,Y,,,,,,,,,,,,,Y,,,,,,,,Y,,,,Y,,,,,,,,,,,,,,,,,,,,,,,,,,,,,,,,,,,,,,,,,,,,,,,
hu16AB18,https://my.personalgenomes.org/profile/hu16AB18,N,N,21-29 years,Male,Hispanic or Latino; White,,,,,,,,,,,,,,,,,,,,,,,,,,,,,,,,,,,,,,,,,,,,,,,,,,,,,,,,,,,,,,,,,,,,,,,,,,,,,,,,,,,,,,,,,,,,,,,,,,,,,,,,,,,,,,,,,,,,,,,,,,,,,,,,,,,,,,,,,,,,,,Y,Y,,,,,,,,,,,,,,,,,,,,,,,,,,,,,,,,,,,,,Y,,,,,,,Y,,,,,,,,,,,,,,,,,,,Y,,,,,,,,,,,,,,,,,,,,,,,,,,,,,,,,,
hu16FFF2,https://my.personalgenomes.org/profile/hu16FFF2,Y,N,30-39 years,Female,White,,,,,,,,,,,,,,,,,,,,,,,,,,,,,,,,,,,,Y,,,,,,,,,,,,,,,,,,,,,,,,,,,,,,,,,,,,,,,,,,,,,,,,,,,,,,,,,,,,,,,,,,,,,,,,,,,,,,,,,,,,,,,,,,,Y,,,,,,,Y,,,,,,,,Y,,,,,,,,,,,,,,,,,,,,,,,,,,,,,,,,,,,,,,,,Y,,,,,Y,,,,,Y,,,,,,,,,,,,,,,,,,,,,,,,,,,,,,,,,,,,,,,,,,,,,,,
hu174334,https://my.personalgenomes.org/profile/hu174334,Y,N,80-89 years,Female,White,,,,,,,,Y,,,Y,Y,,,,,,,,,,,,,,Y,,Y,,,,,,,,Y,,,Y,,,,,,,,,,,,,,,,,,,,,,,,,,,,,,,,,,Y,,Y,,Y,,,,,,,,,,Y,,,,Y,,,,Y,,,,,,Y,,Y,,,,,,,,,,,,,,,,,,,,,,,,,Y,Y,,,,,,,,,,,,Y,Y,,Y,,,,,,,,,,,,Y,,,,,,Y,,,,,Y,,,,,,Y,Y,,Y,,,,,,,Y,,,,,,,,,Y,,Y,,,Y,Y,,Y,Y,Y,Y,Y,,Y,Y,,Y,Y,,,,Y,,,Y,,,,,,,,,,,,,,,,,Y,,,,,
hu17DFDB,https://my.personalgenomes.org/profile/hu17DFDB,N,N,40-49 years,Female,White,,,,,,,,,,,,,,Y,,,,,,,,,,,,,,,,,,,,,,,,,,,,,Y,,,,,,,,,,,Y,,,,,,,,,,,,,,,,,,,,,,,,,,,,,,,,,,,,,Y,,Y,,,,,,,,,Y,,,,,,Y,,,,,,,,,,,,Y,,,,,,,,,,,,,,,,,,,,,,Y,,Y,Y,,,,,,,,,,,,Y,,,,,,,,,,Y,,,,,,,,,,,,,,,,,,,,,,,,,,,,,,,Y,,,,,,,,,,Y,,Y,,,,,,,,,,,,,,,,,,,,,,,,,,,,,
hu1843FC,https://my.personalgenomes.org/profile/hu1843FC,N,N,40-49 years,Female,White,,,,,,,,,,,,,,,,,,,,,,,,,,Y,,Y,Y,,,,,,,Y,,,,,,,,Y,,,,,,,,,,,,,,,,,,,,,,Y,,,Y,,,,,,,,,,,,,,,,,,,,,,,,,,,,,,,,,,,,,,,,,,,,,,,,,,,,,,,,,,,,,,,,,Y,,,,,,,,Y,,,,,,,,,,,,,,,,,,,Y,,,,,,Y,,,,,,,,,,,,,,Y,,,Y,,,,,,,,,,,,,,,,,,,,,,,,Y,,,,,,,,,Y,,,Y,,,,,,,,,,,,,,,,,,,
hu19C09F,https://my.personalgenomes.org/profile/hu19C09F,Y,23andMe,40-49 years,Male,White,,,,,,,,,,,,,,,,,,,,,,,,,,,,,,,,,,,,,,,,,,,,,,,,,,,,,,,,,,,,,,,,,,,,,,,,,,,,,,,,,,,,,,,,,,Y,,,,,,,,,,,,,,,,,,,,,,,,,,,,,,,,,,,,,,,,,,,,,,,,,,,,Y,Y,,,,,,,,,,,,,,,,,,,,,,,,,,,,,,,,,,,,,Y,,,Y,,,,,,,,,Y,,,,,,,,,,,,Y,,,,,,Y,,,,,,,,,,,,,,,,,,,,,,,,,,,,,
hu1A4F2E,https://my.personalgenomes.org/profile/hu1A4F2E,Y,23andMe,60-69 years,Female,Hispanic or Latino,,,,,,,,,,,Y,,,,,,,,,,,,,,,,,,,,,,,,Y,,,,,,,,,,,,,,,,,,,,,,,,,,,,,,,,,,,,,,,,,,,,,,,,,,,,,,Y,Y,Y,,,,,,,,,,,,,,,,,,,,,,,,,,,,,,,,,,,,,,,,,,,,,,,,Y,,,Y,,,,,,,,,,,,,,,,,,,,Y,,,,,,,,,,,,,,,,,,,,,,,,,,,,,,,,,,,,Y,,,,,,,,Y,,,,,,,Y,,,,,,,,,,,,,,,,,,,,,,,,,,
hu1BD549,https://my.personalgenomes.org/profile/hu1BD549,Y,23andMe,50-59 years,Female,White,,,,,,,,Y,,,,,,Y,,,,,,,,,,,,,,,,Y,,,,,,Y,,,,,,,,,,,,,,,,,,,,Y,,,,,,,,,,,,,,,,,,,,,,,,,,,,,,,Y,,Y,Y,,,,,,,Y,,,,,,,,,,,Y,,,,,,,Y,,,,,,,,,,,,,Y,,,,,,,,,,,,,,Y,,,Y,,,,,,,,,,,,,,,,,,,,,,Y,,,,,,,,,,,,,,,Y,,,,,,,,,,,,Y,,,,,,Y,,,,,,,,,,,,,,,,,,,,,,,,,,,,,,,,,,,,,,,Y
hu1EE386,https://my.personalgenomes.org/profile/hu1EE386,N,23andMe,30-39 years,Female,White,,,,,,,,,,,,,,,,,,,,,,,,,,,,,,,,,,,,,,,,,,,,,,,,,,,,,,,,,,,,,,,,,,,,,,Y,,,,,,,,,,,,,,,,,,,,Y,Y,,,,,,,,,,,,,Y,,,,,,,,,,,,,,,,,,,,,Y,,,,,,,,,,,,,,,,,Y,,,,,,,,,,,,,,,,,,,,,,,,,Y,,,,,,,,Y,,Y,,,,,,,,,,,,,,,,,,,,,,,,,,,,,,,,,,Y,,,,,,,,,,,,,,,,,,,,,,,,,,,,
hu1F73AB,https://my.personalgenomes.org/profile/hu1F73AB,N,23andMe,50-59 years,Female,White,,,,,,,,,,,,,,Y,,,,,,,,,,,,,,,,,,,,Y,,,,,,,,,,,,,,,,,,,,,,,,,,,,,,,,,,,,,,,,,,,,,,,,,,,,,,,,,,,,,Y,,,,,,,,,,,,,,,,,,,,,,,,,,,,,,,,,,,,,,,,,,,,,,,Y,,,,,,,,,,,,,,,,,,,,,,,,,,,,,,,,,,,Y,,,,,,,,,,,Y,,,,,,,,,,Y,,,,,,,,,,,,,,,,,,,,,,,,,,,,,,,,,,,,,,,,,
hu20C5DA,https://my.personalgenomes.org/profile/hu20C5DA,N,N,60-69 years,Male,White,,,,,,,,,,,,,,,,Y,,,,,,,,,,,,,,,,,,,,Y,,,,,,,,,,,,,,,,,,,,,,,,,,,,,Y,,,,Y,Y,,,,,,,,,,,,,,,,,,,,Y,Y,Y,,,,,Y,,,,,,,Y,,,,,,,,,,,,,,,,,,,,,,,,,,,,,,,,,,,,,Y,Y,Y,Y,,,,,,,,Y,,,,,,,,,,,,,,,,,,,,,,,,,,,,Y,,,,,,,,,,,,Y,,,,,,,Y,,,,,,,,,,,Y,,,,Y,,,Y,,,,,,,,,,,,,,,,,,,,,,
hu20D710,https://my.personalgenomes.org/profile/hu20D710,N,N,30-39 years,Female,Asian; White,,,,,,,,,,,,,,,,,,,,,,,,,,,Y,,,,,,,,,,,,,,,,,,,,,,,,,,,,,,,,,,,,,,,,,,,,,,,,,,,,,,,,,,,,,,,Y,Y,,,,,,,,,,,,,,,,,,,,,,,,,,,,,,,,,,,,,,,,,,,,,,,,,,Y,Y,Y,,,Y,,,,,,,,,,,,,,,,Y,,,,,Y,,,,,,,,,,,,,,,Y,,,,,Y,,,,,,,,,,,,,,,,,,,,,,,,,,,,,,,,,,,,,,,,,,,,,,,,,,,,
hu2271EB,https://my.personalgenomes.org/profile/hu2271EB,N,N,30-39 years,Female,White,,,,,,,,,,,,,,,,,,,,,,,,,,,,,,,,,,,,,,,,,,,,,,,,,,,,,,,,,,,,,,,,,,,,,,Y,,,,,Y,,,,,,,,,,,,,,,,,,,,,,,,,,,,,,,,,,,,,,,,,,,,,,,,,,,,,,,Y,,,,,,,,,Y,,Y,Y,,Y,,,,,,,,,,,,,,,,,,,,,,,Y,,,,,,,,,,,,,,,Y,,,,,,,,,,Y,,,,,,,,,,,,,,,,,,,,,,,,,,,,,,,,,,,,,,,,,,,,,,,
hu265361,https://my.personalgenomes.org/profile/hu265361,Y,N,50-59 years,Female,White,,,,,,,,,,,,,,,,,,,,,,,,,,,,Y,,,,,,,,Y,,,,,,,,,,,,,,,,,,,,,,,,,,,,,,,,,Y,,,,,,,,,,,,,,,,,,,,,Y,Y,,,,,,,,,,,,,,,,,,,,,,,,,,,,,,,,,,,,,,,,,,,,,,,,,,Y,Y,,Y,,,,,,,,,Y,,,,,,,,,,,,,,,,,,,,,,Y,,,,,,,,,,,,,,,,,Y,,,,,,Y,,,,,,,,,,,,Y,,,,,,,,,,,,,,,,,,,,,,,,,,,,,
hu267A10,https://my.personalgenomes.org/profile/hu267A10,Y,N,21-29 years,Male,Native Hawaiian or Other Pacific Islander; White,,,,,,,,,,,,,,,,,,,,,,,,,,,,,,,,,,,,,,,,,,,,,,,,,,,,,,,,,,,,,,,,,,,,,,,,,,,,,,,,,,,,,,,,,,Y,Y,,,,,,,,,,,,,,,,,,,,,,,,,,,,,,,,,,,,,,,,,,,,,,,,,,,Y,Y,,,,,,,,,,,,,,,,,,,,,,,,,,,,,,,,,,,,,Y,,,,,,,,,,,,Y,,,,,,,,,,,,,,,,,,,,,,,,,,,,,,,,Y,,,,,,,,,,,,,,,
hu269E6C,https://my.personalgenomes.org/profile/hu269E6C,Y,N,21-29 years,Male,White,,,,,,,,,,,,,,,,,,,,,,,,,,,,,,,,,,,,,,,,,,,,,,,,,,,,,,,,,,,,,,,,,,,,,,,,,,,,,,,,,,,,,,,,,,Y,,,,,,,,,,,,,,,,,,,,,,,,,,,,,,,,,,,,,,,,,,,,,,,,,,,,Y,,,,,,,,,,,,,,,,,,,,,,,,,,,,,,,,,,,,,,,Y,,,,,,,Y,,,,Y,,,,,,,,,,,,,,,,,,,,,,,,,,,,,,,,,,,,,,,,,,,,,,,
hu26B551,https://my.personalgenomes.org/profile/hu26B551,Y,N,50-59 years,Female,White,,,,,,,,,,Y,,,,,,,,,,,,,,,,,,,,,,,,,,,,,,,,,,,,,,,,,,,,,,,,,,,,,,,,,,,,,,,,,,,,,,,,,,,,,,,,Y,,,,,,,,,,,Y,,,,,,,,,,,,,,,,,,,,,,,,,,,,,,,,,,,,,,Y,,,Y,,,Y,,,,,,,,,,,,,,,,,,,,,,,,,,,,,,,,,,,,,,,,,,Y,,,,,,,,,,,,,,Y,,,Y,,,,,,Y,,,,,,,,,,,,,,,,,,,,,,,,,,,,,
hu2843C9,https://my.personalgenomes.org/profile/hu2843C9,Y,N,70-79 years,Male,White,,,,,,,,,,,,,,,,,,,,Y,,,,,,,,,,,,,,,,Y,,,,,,,,,,,,,,,,,,,,,,,,,,,,,,,,,,,,,,,,,,,,,,,,,,,,,,Y,,,,,Y,,Y,,,,,,,,,,,,,,,,,,,,,Y,,,,,,,,,,,,Y,,,,,,,,,,,,Y,,,,,,,,,,,,,,Y,,,,,,,,,,,,,,,,,,,,,,,,,Y,,,,,,,,,,,,,,,,,,,,,,,,,,Y,,Y,,,,,,,,,,,,,,,,,,,,,,,,,,,,,,
hu2AF047,https://my.personalgenomes.org/profile/hu2AF047,N,N,60-69 years,Female,White,,,,,,,,,Y,,,,,,,,,,,,,,,,,,,Y,Y,,,,,,,Y,Y,,,,,,,,,,,,,,,,,,,,,,,,,,,,,,,,,Y,,,,,,,,,,,,,,,,,Y,,,Y,Y,Y,,,,,Y,,,,,,,,,,,,,,,,,,,,,Y,,,,,,,Y,,,,,,,,,,,,,,,,,,Y,Y,,,,,,,,,,,,,Y,,,,,,,,,,Y,,,,,,,Y,,,Y,,,,Y,,,,,,,,,,,,,,,,,,,,,,,,,Y,,Y,,,,,,Y,,Y,Y,,,,,,,,,,,,,,,,,,,,,,
hu2BC187,https://my.personalgenomes.org/profile/hu2BC187,Y,23andMe,30-39 years,Male,White,,,,,,,,,,,,,,,,,,,,,,,,,,,,,,,,,,,,,,,,,,,,,,,,,,,,,,,,,,,,,,,,,,,,,Y,,,,,,,,,,,,,,,,,,,,,Y,Y,,,,Y,,Y,,,,,,,,,,,,,,,,,,,,,,,,,,,,,,,,,,,,,,,,Y,,,,,Y,,,Y,,,,,,,,,,,,,,,,,,,,,,,,,,,,,,,,,,,,,,,Y,,,Y,,,,,Y,,,,,,,,,,,,,,,,,,,,,,,,,,,,,,,,,,,,,,,,,,,,,,,
hu2C1D94,https://my.personalgenomes.org/profile/hu2C1D94,Y,N,21-29 years,Male,American Indian / Alaska Native; White,,,,,,,,,,,,,,,,,,,,,,,,,,,,,,,,,,,,,,,,,,,,,,,,,,,,,,,,,,,,,,,,,,,,,Y,,,,,,,,,,,,,,,,,,,,,,,,,,,,,,,,,,,,,,,,,,,,,,,,,,,,,,,,,,,,,,,,,,,,,,,,,Y,,,,Y,,,,,,,,,,,Y,,,,,,,,,,,,,,,,,,,,,,,,,,,,,,,,,,,,,,,,,,,,,,,,,,,,,,,,,,,,,,,,,,,,,,,,,,,,,,,,,,
hu2D0BB4,https://my.personalgenomes.org/profile/hu2D0BB4,N,N,40-49 years,Female,White,,,,,,,,,,,,,,,,,,,,,,,,,,,,,,,,,,,,,,,,,,,,,,,,,,,,,,,,,,,,,,,,,,,,,,,,,,,,,,,,,,,,,,,,,,Y,,Y,,,,,,,,,,,,,,,,,,,,,,,,,,,,,,,,,,,,,,,,,,,,,,,,,,Y,,Y,,,,,,,,,,,,,,,,,,,,,,,Y,,,,,,Y,,,,,,,,,,,,,,Y,,,,,Y,,,,,,,,,,,,,,,,,,,,,,,,,,,,,,,,,,,,,,,,,,,,,,,
hu2FEC01,https://my.personalgenomes.org/profile/hu2FEC01,Y,23andMe; Family Tree DNA,21-29 years,Male,American Indian / Alaska Native; White,,,,,,,,,,,,,,,,,,,,,,,,,,,,,,,,,,,,,,,,,,,,,,,,,,,,,,,,,,,,,,,,,,,,,Y,,,,,,,,,,,,,,,,,,,,,Y,Y,,Y,,,,,,,,,,,,,,,,,,,,,,,,,,,,,,,,,,,,,,,,,,,,,,Y,,,Y,,,,,,,,,,,,,,,,,,,,,,,,,,,,,,,,,,,,,,Y,,,,,,,Y,,,,,Y,,,,,,,,,,,,,,,,,,,,,,,,,,,,,,,,,,,,,,,,,,,,,,,